Target
Beta-2 adrenergic receptor
Ligand
BDBM50243222
Substrate
Meas. Tech.
ChEMBL_492277 (CHEMBL947245)
EC50
>1000±n/a nM
Citation
 Imanishi, MItou, SWashizuka, KHamashima, HNakajima, YAraki, TTomishima, YSakurai, MMatsui, SImamura, EUeshima, KYamamoto, TYamamoto, NIshikawa, HNakano, KUnami, NHamada, KMatsumura, YTakamura, FHattori, K Discovery of a novel series of biphenyl benzoic acid derivatives as highly potent and selective human beta3 adrenergic receptor agonists with good oral bioavailability. Part II. J Med Chem 51:4002-20 (2008)  
Target
Name:
Beta-2 adrenergic receptor
Synonyms:
ADRB2 ADRB2_HUMAN Beta-2 adrenoceptor | Beta-2 adrenoreceptor
Type:
Mol. Mass.:
46461.69
Organism:
Homo sapiens (Human)
Description:
P07550
Residue:
413
  
Inhibitor
Name:
BDBM50243222
Synonyms:
4-[(2R)-2-{[(2R)-2-Hydroxy-2-phenylethyl]amino}propyl]biphenyl-4-carboxylic acid | CHEMBL507003
Type:
Small organic molecule
Emp. Form.:
C24H25NO3
Mol. Mass.:
375.4602
SMILES:
C[C@H](Cc1ccc(cc1)-c1ccc(cc1)C(O)=O)NC[C@H](O)c1ccccc1
: