Target
Beta-2 adrenergic receptor
Ligand
BDBM25392
Substrate
Meas. Tech.
ChEMBL_492277 (CHEMBL947245)
EC50
2±n/a nM
Citation
 Imanishi, MItou, SWashizuka, KHamashima, HNakajima, YAraki, TTomishima, YSakurai, MMatsui, SImamura, EUeshima, KYamamoto, TYamamoto, NIshikawa, HNakano, KUnami, NHamada, KMatsumura, YTakamura, FHattori, K Discovery of a novel series of biphenyl benzoic acid derivatives as highly potent and selective human beta3 adrenergic receptor agonists with good oral bioavailability. Part II. J Med Chem 51:4002-20 (2008)  
Target
Name:
Beta-2 adrenergic receptor
Synonyms:
ADRB2 ADRB2_HUMAN Beta-2 adrenoceptor | Beta-2 adrenoreceptor
Type:
Mol. Mass.:
46461.69
Organism:
Homo sapiens (Human)
Description:
P07550
Residue:
413
  
Inhibitor
Name:
BDBM25392
Synonyms:
4-[1-hydroxy-2-(isopropylamino)ethyl]pyrocatechol;hydrochloride 4-{1-hydroxy-2-[(propan-2-yl)amino]ethyl}benzene-1,2-diol, 2 ISOPROTERONOL Isoproterenol Isoproterenol,(+) Norisodrine | Novodrin
Type:
Small organic molecule
Emp. Form.:
C11H17NO3
Mol. Mass.:
211.2576
SMILES:
CC(C)NCC(O)c1ccc(O)c(O)c1
: