Target
Lysosomal alpha-mannosidase
Ligand
BDBM50263049
Substrate
Meas. Tech.
ChEMBL_489067 (CHEMBL987287)
IC50
2000±n/a nM
Citation
 Fiaux, HKuntz, DAHoffman, DJanzer, RCGerber-Lemaire, SRose, DRJuillerat-Jeanneret, L Functionalized pyrrolidine inhibitors of human type II alpha-mannosidases as anti-cancer agents: optimizing the fit to the active site. Bioorg Med Chem 16:7337-46 (2008)  
Target
Name:
Lysosomal alpha-mannosidase
Synonyms:
LAMAN MAN2B1 | MANB
Type:
PROTEIN
Mol. Mass.:
113753.32
Organism:
Homo sapiens (Human)
Description:
ChEMBL_1432452
Residue:
1011
  
Inhibitor
Name:
BDBM50263049
Synonyms:
(3R,4R,5R)-3,4-dihydroxy-5-(((R)-2-hydroxy-1-phenylethylamino)methyl)-1-methylpyrrolidin-2-one CHEMBL476926
Type:
Small organic molecule
Emp. Form.:
C14H20N2O4
Mol. Mass.:
280.3196
SMILES:
CN1[C@H](CN[C@@H](CO)c2ccccc2)[C@@H](O)[C@@H](O)C1=O
: