Target
Beta-secretase 2
Ligand
BDBM50254707
Substrate
Meas. Tech.
ChEMBL_560486 (CHEMBL1020506)
IC50
>100000±n/a nM
Citation
 Chirapu, SRPachaiyappan, BNural, HFCheng, XYuan, HLankin, DCAbdul-Hay, SOThatcher, GRShen, YKozikowski, APPetukhov, PA Molecular modeling, synthesis, and activity studies of novel biaryl and fused-ring BACE1 inhibitors. Bioorg Med Chem Lett 19:264-74 (2008)  
Target
Name:
Beta-secretase 2
Synonyms:
AEPLC ASP1 Asp 1 Aspartyl protease 1 BACE2_HUMAN Beta-secretase (BACE) Beta-secretase 2 (BACE-2) Beta-site APP-cleaving enzyme 2 Memapsin-1 beta-Secretase (BACE-2)
Type:
Protein
Mol. Mass.:
56171.20
Organism:
Homo sapiens (Human)
Description:
Q9Y5Z0
Residue:
518
  
Inhibitor
Name:
BDBM50254707
Synonyms:
CHEMBL473652 | N1-((2S,3R)-4-(cyclopropylamino)-3-hydroxy-1-phenylbutan-2-yl)-N3-((R)-1-phenylethyl)-5-(thiophen-3-yl)isophthalamide
Type:
Small organic molecule
Emp. Form.:
C33H35N3O3S
Mol. Mass.:
553.714
SMILES:
C[C@@H](NC(=O)c1cc(cc(c1)-c1ccsc1)C(=O)N[C@@H](Cc1ccccc1)[C@H](O)CNC1CC1)c1ccccc1
: