Target
Type-1 angiotensin II receptor
Ligand
BDBM50035431
Substrate
Meas. Tech.
ChEMBL_36949 (CHEMBL648852)
IC50
0.780000±n/a nM
Citation
 Chang, LLAshton, WTFlanagan, KLNaylor, EMChakravarty, PKPatchett, AAGreenlee, WJBendesky, RJChen, TBFaust, KAKling, PJSchaffer, LWSchorn, TWZingaro, GJChang, RSLotti, VJKivlighn, SDSiegl, PK Triazolinones as nonpeptide angiotensin II antagonists. 2. discovery of a potent and orally active triazolinone acylsulfonamide Bioorg Med Chem Lett 4:115-120 (1994)    Article 
Target
Name:
Type-1 angiotensin II receptor
Synonyms:
AGTR1 ANGIOTENSIN AT1 Angiotensin II type 1a (AT-1a) receptor
Type:
Enzyme Catalytic Domain
Mol. Mass.:
41009.15
Organism:
RABBIT
Description:
ANGIOTENSIN AT1 AGTR1 RABBIT::P34976
Residue:
359
  
Inhibitor
Name:
BDBM50035431
Synonyms:
5-Butyl-4-[2'-(1H-tetrazol-5-yl)-biphenyl-4-ylmethyl]-2-(2-trifluoromethyl-phenyl)-2,4-dihydro-[1,2,4]triazol-3-one CHEMBL19018
Type:
Small organic molecule
Emp. Form.:
C27H24F3N7O
Mol. Mass.:
519.521
SMILES:
CCCCc1nn(-c2ccccc2C(F)(F)F)c(=O)n1Cc1ccc(cc1)-c1ccccc1-c1nnn[nH]1
: