Target
Type-2 angiotensin II receptor
Ligand
BDBM50283307
Substrate
Meas. Tech.
ChEBML_35442
IC50
0.210000±n/a nM
Citation
 Glinka, TWde Laszlo, SESiegl, PKChang, RSKivlighn, SDSchorn, TSFaust, KAChen, TBZingaro, GJLotti, VJGreenlee, WJ Development of angiotensin II antagonists with equipotent affinity for human AT1 and AT2 receptor subtypes. Bioorg Med Chem Lett 4:2337-2342 (1994)    Article 
Target
Name:
Type-2 angiotensin II receptor
Synonyms:
AGTR2_RAT Agtr2 Angiotensin II receptor Type-2 angiotensin II receptor
Type:
Enzyme Catalytic Domain
Mol. Mass.:
41346.62
Organism:
RAT
Description:
Angiotensin II AT2 0 0::P35351
Residue:
363
  
Inhibitor
Name:
BDBM50283307
Synonyms:
4'-[2-Ethyl-6-(3-isopropyl-3-methyl-ureido)-4-oxo-4H-quinazolin-3-ylmethyl]-3'-fluoro-biphenyl-2-sulfonic acid (2-isobutoxy-acetyl)-amide | CHEMBL311386
Type:
Small organic molecule
Emp. Form.:
C34H40FN5O6S
Mol. Mass.:
665.775
SMILES:
CCc1nc2ccc(NC(=O)N(C)C(C)C)cc2c(=O)n1Cc1ccc(cc1F)-c1ccccc1S(=O)(=O)NC(=O)COCC(C)C
: