Target
Type-1 angiotensin II receptor
Ligand
BDBM50283319
Substrate
Meas. Tech.
ChEBML_34645
IC50
0.130000±n/a nM
Citation
 Glinka, TWde Laszlo, SESiegl, PKChang, RSKivlighn, SDSchorn, TSFaust, KAChen, TBZingaro, GJLotti, VJGreenlee, WJ Development of angiotensin II antagonists with equipotent affinity for human AT1 and AT2 receptor subtypes. Bioorg Med Chem Lett 4:2337-2342 (1994)    Article 
Target
Name:
Type-1 angiotensin II receptor
Synonyms:
AGTR1 ANGIOTENSIN AT1 Angiotensin II type 1a (AT-1a) receptor
Type:
Enzyme Catalytic Domain
Mol. Mass.:
41009.15
Organism:
RABBIT
Description:
ANGIOTENSIN AT1 AGTR1 RABBIT::P34976
Residue:
359
  
Inhibitor
Name:
BDBM50283319
Synonyms:
2-Butyl-3-(3-fluoro-2'-(2-cyclopropylethyloxycarbonylaminosulphonyl)-biphenyl-4-ylmethyl)-6-(isopropyl-methyl-aminocarbonylamino)-3H-quinazolin-4-one | CHEMBL306362
Type:
Small organic molecule
Emp. Form.:
C36H42FN5O6S
Mol. Mass.:
691.812
SMILES:
CCCCc1nc2ccc(NC(=O)N(C)C(C)C)cc2c(=O)n1Cc1ccc(cc1F)-c1ccccc1S(=O)(=O)NC(=O)OCCC1CC1
: