Target
Mitogen-activated protein kinase 1/3
Ligand
BDBM50290834
Substrate
Meas. Tech.
ChEMBL_124146 (CHEMBL737108)
IC50
>10000±n/a nM
Citation
 Kubo, KShimizu, TOhyama, SiMurooka, HNishitoba, TKato, SKobayashi, YYagi, MIsoe, TNakamura, KOsawa, TIzawa, T A novel series of 4-phenoxyquinolines: potent and highly selective inhibitors of PDGF receptor autophosphorylation Bioorg Med Chem Lett 7:2935-2940 (1997)    Article 
Target
Name:
Mitogen-activated protein kinase 1/3
Synonyms:
Mitogen-activated protein kinase; ERK1/ERK2 t-ERK1/2
Type:
Mol. Mass.:
Description:
ASSAY_ID of ChEMBL is 124147
Components:
This complex has 2 components.
Component 1
Name:
Mitogen-activated protein kinase 1
Synonyms:
ERK2 Extracellular signal-regulated kinase 2 Extracellular signal-regulated kinase 2 (ERK2) MAPK 2 MK01_HUMAN Mitogen-activated protein kinase 1 (ERK-2) Mitogen-activated protein kinase 2 PRKM2 | p42-MAPK
Type:
Ser/Thr Protein Kinase
Mol. Mass.:
41392.76
Organism:
Homo sapiens (Human)
Description:
P28482
Residue:
360
  
Component 2
Name:
Mitogen-activated protein kinase 3
Synonyms:
ERK1 Extracellular signal-regulated kinase 1 MAP kinase ERK1 MAPK3/MAPK7 Mitogen-activated protein kinase PRKM3
Type:
Protein
Mol. Mass.:
43136.58
Organism:
Homo sapiens (Human)
Description:
curated by PDB 4QTB
Residue:
379
  
Inhibitor
Name:
BDBM50290834
Synonyms:
4-(3,4-Dimethoxy-phenoxy)-6,7-dimethoxy-quinoline | CHEMBL327300
Type:
Small organic molecule
Emp. Form.:
C19H19NO5
Mol. Mass.:
341.3579
SMILES:
COc1ccc(Oc2ccnc3cc(OC)c(OC)cc23)cc1OC
: