Target
Cathepsin K
Ligand
BDBM50313475
Substrate
Meas. Tech.
ChEMBL_617377 (CHEMBL1101888)
IC50
680±n/a nM
Citation
 Rankovic, ZCai, JKerr, JFradera, XRobinson, JMistry, AHamilton, EMcGarry, GAndrews, FCaulfield, WCumming, IDempster, MWaller, JScullion, PMartin, IMitchell, ALong, CBaugh, MWestwood, PKinghorn, EBruin, JHamilton, WUitdehaag, Jvan Zeeland, MPotin, DSaniere, LFouquet, AChevallier, FDeronzier, HDorleans, CNicolai, E Design and optimization of a series of novel 2-cyano-pyrimidines as cathepsin K inhibitors. Bioorg Med Chem Lett 20:1524-7 (2010)  
Target
Name:
Cathepsin K
Synonyms:
CATK_HUMAN CTSO Cathepsin O Cathepsin X
Type:
Enzyme
Mol. Mass.:
36975.68
Organism:
Homo sapiens (Human)
Description:
P43235
Residue:
329
  
Inhibitor
Name:
BDBM50313475
Synonyms:
4-cyclohexyl-6-propylpyrimidine-2-carbonitrile | CHEMBL1085896
Type:
Small organic molecule
Emp. Form.:
C14H19N3
Mol. Mass.:
229.3208
SMILES:
CCCc1cc(nc(n1)C#N)C1CCCCC1
: