Target
11-beta-hydroxysteroid dehydrogenase 1
Ligand
BDBM50317225
Substrate
Meas. Tech.
ChEMBL_631347 (CHEMBL1105684)
IC50
0.34±n/a nM
Citation
 Cheng, HHoffman, JLe, PNair, SKCripps, SMatthews, JSmith, CYang, MKupchinsky, SDress, KEdwards, MCole, BWalters, ELoh, CErmolieff, JFanjul, ABhat, GBHerrera, JPauly, THosea, NPaderes, GRejto, P The development and SAR of pyrrolidine carboxamide 11beta-HSD1 inhibitors. Bioorg Med Chem Lett 20:2897-902 (2010)  
Target
Name:
11-beta-hydroxysteroid dehydrogenase 1
Synonyms:
11-DH 11-beta-Hydroxysteroid Dehydrogenase 1 (11-beta-HSD1) 11-beta-hydroxysteroid dehydrogenase 1 (11HSD1) Corticosteroid 11-beta-dehydrogenase isozyme 1 (11-beta-HSD-1) Corticosteroid 11-beta-dehydrogenase isozyme 1 (11beta-HSD1) HSD11 HSD11L | SDR26C1
Type:
Enzyme
Mol. Mass.:
32409.16
Organism:
Homo sapiens (Human)
Description:
P28845
Residue:
292
  
Inhibitor
Name:
BDBM50317225
Synonyms:
(2R)-N-(adamantan-2-yl)-1-[(1-hydroxycyclopentyl)methyl]pyrrolidine-2-carboxamide | CHEMBL1095787
Type:
Small organic molecule
Emp. Form.:
C21H34N2O2
Mol. Mass.:
346.5069
SMILES:
OC1(CN2CCC[C@@H]2C(=O)NC2C3CC4CC(C3)CC2C4)CCCC1
: