Target
Histamine H4 receptor
Ligand
BDBM50317865
Substrate
Meas. Tech.
ChEMBL_629977 (CHEMBL1112054)
Ki
1.1±n/a nM
Citation
 Ishikawa, MShinei, RYokoyama, FYamauchi, MOyama, MOkuma, KNagayama, TKato, KKakui, NSato, Y Role of hydrophobic substituents on the terminal nitrogen of histamine in receptor binding and agonist activity: development of an orally active histamine type 3 receptor agonist and evaluation of its antistress activity in mice. J Med Chem 53:3840-4 (2010)  
Target
Name:
Histamine H4 receptor
Synonyms:
AXOR35 GPCR105 HH4R HRH4 Histamine H4 receptor Histamine receptor (H3 and H4) SP9144
Type:
G Protein-Coupled Receptor (GPCR)
Mol. Mass.:
44517.02
Organism:
Homo sapiens (Human)
Description:
Binding assays were using CHO cells stably expressing hH4R receptors.
Residue:
390
  
Inhibitor
Name:
BDBM50317865
Synonyms:
2-(2-(4-tert-Butylphenylthio)ethyl)-1H-imidazole CHEMBL1098230
Type:
Small organic molecule
Emp. Form.:
C15H20N2S
Mol. Mass.:
260.398
SMILES:
CC(C)(C)c1ccc(SCCc2cnc[nH]2)cc1
: