Target
Metabotropic glutamate receptor 2
Ligand
BDBM50318344
Substrate
Meas. Tech.
ChEMBL_629753 (CHEMBL1121265)
EC50
1300±n/a nM
Citation
 Brnardic, EJFraley, MEGarbaccio, RMLayton, MESanders, JMCulberson, CJacobson, MAMagliaro, BCHutson, PHO'Brien, JAHuszar, SLUslaner, JMFillgrove, KLTang, CKuo, YSur, SMHartman, GD 3-Aryl-5-phenoxymethyl-1,3-oxazolidin-2-ones as positive allosteric modulators of mGluR2 for the treatment of schizophrenia: Hit-to-lead efforts. Bioorg Med Chem Lett 20:3129-33 (2010)  
Target
Name:
Metabotropic glutamate receptor 2
Synonyms:
GPRC1B GRM2_HUMAN Metabotropic glutamate receptor mGlu2 | metabotropic glutamate 2
Type:
Enzyme
Mol. Mass.:
95584.88
Organism:
Homo sapiens (Human)
Description:
Q14416
Residue:
872
  
Inhibitor
Name:
BDBM50318344
Synonyms:
5-butyl-3-phenyloxazolidin-2-one | CHEMBL1095703
Type:
Small organic molecule
Emp. Form.:
C13H17NO2
Mol. Mass.:
219.2796
SMILES:
CCCCC1CN(C(=O)O1)c1ccccc1
: