Target
Cathepsin K
Ligand
BDBM50323080
Substrate
Meas. Tech.
ChEMBL_643702 (CHEMBL1212566)
IC50
195±n/a nM
Citation
 Cai, JBennett, DJRankovic, ZDempster, MFradera, XGillespie, JCumming, IFinlay, WBaugh, MBoucharens, SBruin, JCameron, KSHamilton, WKerr, JKinghorn, EMcGarry, GRobinson, JScullion, PUitdehaag, JCvan Zeeland, MPotin, DSaniere, LFouquet, AChevallier, FDeronzier, HDorleans, CNicolai, E 2-Phenyl-9H-purine-6-carbonitrile derivatives as selective cathepsin S inhibitors. Bioorg Med Chem Lett 20:4447-50 (2010)  
Target
Name:
Cathepsin K
Synonyms:
CATK_HUMAN CTSO Cathepsin O Cathepsin X
Type:
Enzyme
Mol. Mass.:
36975.68
Organism:
Homo sapiens (Human)
Description:
P43235
Residue:
329
  
Inhibitor
Name:
BDBM50323080
Synonyms:
4-(3-cyclopropylphenyl)-6-propylpyrimidine-2-carbonitrile | CHEMBL1209313
Type:
Small organic molecule
Emp. Form.:
C17H17N3
Mol. Mass.:
263.337
SMILES:
CCCc1cc(nc(n1)C#N)-c1cccc(c1)C1CC1
: