Target
Broad substrate specificity ATP-binding cassette transporter ABCG2
Ligand
BDBM50339156
Substrate
Meas. Tech.
ChEMBL_735838 (CHEMBL1694230)
IC50
12300±n/a nM
Citation
 Versiani, MADiyabalanage, TRatnayake, RHenrich, CJBates, SEMcMahon, JBGustafson, KR Flavonoids from eight tropical plant species that inhibit the multidrug resistance transporter ABCG2. J Nat Prod 74:262-6 (2011)  
Target
Name:
Broad substrate specificity ATP-binding cassette transporter ABCG2
Synonyms:
ABCG2 ABCP ATP-binding cassette sub-family G member 2 ATP-binding cassette, sub-family G, member 2 BCRP1 CDw338 Mitoxantrone resistance-associated protein Urate exporter
Type:
Multi-pass membrane protein; monomer or homodimer; disulfide-linked
Mol. Mass.:
72329.48
Organism:
Homo sapiens (Human)
Description:
Q9UNQ0
Residue:
655
  
Inhibitor
Name:
BDBM50339156
Synonyms:
(S)-8-(3,7-dimethylocta-2,6-dienyl)-5,7-dihydroxy-2-(4-hydroxyphenyl)chroman-4-one CHEMBL490697 | sophoraflavanone A
Type:
Small organic molecule
Emp. Form.:
C25H28O5
Mol. Mass.:
408.4868
SMILES:
[#6]\[#6](-[#6])=[#6]\[#6]-[#6]\[#6](-[#6])=[#6]\[#6]-c1c(-[#8])cc(-[#8])c2-[#6](=O)-[#6]-[#6@H](-[#8]-c12)-c1ccc(-[#8])cc1
: