Target
Epidermal growth factor receptor
Ligand
BDBM50193995
Substrate
Meas. Tech.
ChEMBL_542078 (CHEMBL1016947)
IC50
>10000±n/a nM
Citation
 Changelian, PSFlanagan, MEBall, DJKent, CRMagnuson, KSMartin, WHRizzuti, BJSawyer, PSPerry, BDBrissette, WHMcCurdy, SPKudlacz, EMConklyn, MJElliott, EAKoslov, ERFisher, MBStrelevitz, TJYoon, KWhipple, DASun, JMunchhof, MJDoty, JLCasavant, JMBlumenkopf, TAHines, MBrown, MFLillie, BMSubramanyam, CShang-Poa, CMilici, AJBeckius, GEMoyer, JDSu, CWoodworth, TGGaweco, ASBeals, CRLittman, BHFisher, DASmith, JFZagouras, PMagna, HASaltarelli, MJJohnson, KSNelms, LFDes Etages, SGHayes, LSKawabata, TTFinco-Kent, DBaker, DLLarson, MSi, MSPaniagua, RHiggins, JHolm, BReitz, BZhou, YJMorris, REO'Shea, JJBorie, DC Prevention of organ allograft rejection by a specific Janus kinase 3 inhibitor. Science 302:875-878 (2003)  
Target
Name:
Epidermal growth factor receptor
Synonyms:
EGF Receptor Substrate EGFR_HUMAN ERBB1 Epidermal Growth Factor Receptor erbB-1 Epidermal growth factor receptor (EGFR) HER1 Proto-oncogene c-ErbB-1 Tyrosine-Protein Kinase ErbB-1
Type:
Receptor Kinase Domain
Mol. Mass.:
134279.59
Organism:
Homo sapiens (Human)
Description:
P00533
Residue:
1210
  
Inhibitor
Name:
BDBM50193995
Synonyms:
3-((3R,4R)-4-methyl-3-(methyl(7H-pyrrolo[2,3-d]pyrimidin-4-yl)amino)piperidin-1-yl)-3-oxopropanenitrile 3-{(3R,4R)-4-methyl-3-[methyl(7H-pyrrolo[2,3-d]pyrimidin-4-yl)amino]piperidin-1-yl}-3-oxopropanenitrile CP-690550 Tofacitinib US10112907, Example 00035 US10766894, Compound TABLE 1.20 US11078206, Example Tofacitinib US11339167, Example Tofacitinib
Type:
Small organic molecule
Emp. Form.:
C16H20N6O
Mol. Mass.:
312.3696
SMILES:
C[C@@H]1CCN(C[C@@H]1N(C)c1ncnc2[nH]ccc12)C(=O)CC#N
: