Target
Transient receptor potential cation channel subfamily V member 1
Ligand
BDBM50056355
Substrate
Meas. Tech.
ChEMBL_1451403 (CHEMBL3363963)
IC50
40±n/a nM
Citation
 Voight, EAGomtsyan, ARDaanen, JFPerner, RJSchmidt, RGBayburt, EKDiDomenico, SMcDonald, HAPuttfarcken, PSChen, JNeelands, TRBianchi, BRHan, PReilly, RMFranklin, PHSegreti, JANelson, RASu, ZKing, AJPolakowski, JSBaker, SJGauvin, DMLewis, LRMikusa, JPJoshi, SKFaltynek, CRKym, PRKort, ME Discovery of (R)-1-(7-chloro-2,2-bis(fluoromethyl)chroman-4-yl)-3-(3-methylisoquinolin-5-yl)urea (A-1165442): a temperature-neutral transient receptor potential vanilloid-1 (TRPV1) antagonist with analgesic efficacy. J Med Chem 57:7412-24 (2014)  
Target
Name:
Transient receptor potential cation channel subfamily V member 1
Synonyms:
Capsaicin receptor Osm-9-like TRP channel 1 TRPV1_HUMAN Transient receptor potential cation channel subfamily V member 1 (TRPV1) Transient receptor potential cation channel subfamily V member 1(TRPV1) Vanilloid VR1 Vanilloid receptor 1 Vanilloid receptor 1 (VRI/TRPV1)
Type:
Protein
Mol. Mass.:
94960.75
Organism:
Homo sapiens (Human)
Description:
Q8NER1
Residue:
839
  
Inhibitor
Name:
BDBM50056355
Synonyms:
CHEMBL3326578
Type:
Small organic molecule
Emp. Form.:
C24H26FN3O2
Mol. Mass.:
407.4805
SMILES:
CCC1(CC)C[C@@H](NC(=O)Nc2cccc3cnc(C)cc23)c2cc(F)ccc2O1
: