Target
Sodium channel protein type 9 subunit alpha
Ligand
BDBM50130533
Substrate
Meas. Tech.
ChEMBL_1525514 (CHEMBL3636867)
IC50
330±n/a nM
Citation
 Suzuki, SKuroda, TKimoto, HDomon, YKubota, KKitano, YYokoyama, TShimizugawa, ASugita, RKoishi, RAsano, DTamaki, KShinozuka, TKobayashi, H Discovery of (phenoxy-2-hydroxypropyl)piperidines as a novel class of voltage-gated sodium channel 1.7 inhibitors. Bioorg Med Chem Lett 25:5419-23 (2015)  
Target
Name:
Sodium channel protein type 9 subunit alpha
Synonyms:
Kiaa4197 Peripheral sodium channel 1 Scn9a Sodium channel protein type IX subunit alpha | Voltage-gated sodium channel subunit alpha Nav1.7
Type:
PROTEIN
Mol. Mass.:
225808.99
Organism:
Mus musculus
Description:
ChEMBL_109594
Residue:
1984
  
Inhibitor
Name:
BDBM50130533
Synonyms:
CHEMBL3632693
Type:
Small organic molecule
Emp. Form.:
C24H27F3N2O4
Mol. Mass.:
464.4774
SMILES:
COc1cc(ccc1OCC(O)CN1CCC(CC1)N1Cc2ccccc2C1=O)C(F)(F)F
: