Target
Myeloperoxidase
Ligand
BDBM50133595
Substrate
Meas. Tech.
ChEMBL_1526125 (CHEMBL3636509)
Ki
316±n/a nM
Citation
 Ruggeri, RBBuckbinder, LBagley, SWCarpino, PAConn, ELDowling, MSFernando, DPJiao, WKung, DWOrr, STQi, YRocke, BNSmith, AWarmus, JSZhang, YBowles, DWidlicka, DWEng, HRyder, TSharma, RWolford, AOkerberg, CWalters, KMaurer, TSZhang, YBonin, PDSpath, SNXing, GHepworth, DAhn, KKalgutkar, AS Discovery of 2-(6-(5-Chloro-2-methoxyphenyl)-4-oxo-2-thioxo-3,4-dihydropyrimidin-1(2H)-yl)acetamide (PF-06282999): A Highly Selective Mechanism-Based Myeloperoxidase Inhibitor for the Treatment of Cardiovascular Diseases. J Med Chem 58:8513-28 (2015)  
Target
Name:
Myeloperoxidase
Synonyms:
84 kDa myeloperoxidase MPO Myeloperoxidase Myeloperoxidase heavy chain PERM_HUMAN
Type:
Enzyme
Mol. Mass.:
83888.32
Organism:
Homo sapiens (Human)
Description:
P05164
Residue:
745
  
Inhibitor
Name:
BDBM50133595
Synonyms:
CHEMBL3633460
Type:
Small organic molecule
Emp. Form.:
C13H12ClN3O3S
Mol. Mass.:
325.771
SMILES:
COc1ccc(Cl)cc1-c1cc(=O)[nH]c(=S)n1CC(N)=O
: