Target
Metabotropic glutamate receptor 6
Ligand
BDBM50169689
Substrate
Meas. Tech.
ChEMBL_1576638 (CHEMBL3807556)
EC50
>30000±n/a nM
Citation
 Pero, JERossi, MAKelly, MJLehman, HDLayton, MEGarbaccio, RMO'Brien, JAMagliaro, BCUslaner, JMHuszar, SLFillgrove, KLTang, CKuo, YJoyce, LASherer, ECJacobson, MA Optimization of Novel Aza-benzimidazolone mGluR2 PAMs with Respect to LLE and PK Properties and Mitigation of CYP TDI. ACS Med Chem Lett 7:312-7 (2016)  
Target
Name:
Metabotropic glutamate receptor 6
Synonyms:
GPRC1F GRM6_HUMAN Metabotropic glutamate receptor 6 metabotropic glutamate 6
Type:
Enzyme Catalytic Domain
Mol. Mass.:
95479.26
Organism:
Homo sapiens (Human)
Description:
metabotropic glutamate 6 GRM6 HUMAN::O15303
Residue:
877
  
Inhibitor
Name:
BDBM50169689
Synonyms:
CHEMBL3805203
Type:
Small organic molecule
Emp. Form.:
C21H27N7O2S
Mol. Mass.:
441.55
SMILES:
[H][C@@]12CC[C@@]([H])(CN1C(=O)c1csnn1)N(C2)c1ccc2n(CC(C)(C)C)c(=O)n(C)c2n1
: