Target
Cytochrome P450 3A4
Ligand
BDBM50205151
Substrate
Meas. Tech.
ChEMBL_1628093 (CHEMBL3870678)
IC50
4300±n/a nM
Citation
 Zhao, ZPissarnitski, DAJosien, HBBara, TAClader, JWLi, HMcBriar, MDRajagopalan, MXu, RTerracina, GHyde, LSong, LZhang, LParker, EMOsterman, RBuevich, AV Substituted 4-morpholine N-arylsulfonamides as¿-secretase inhibitors. Eur J Med Chem 124:36-48 (2016)  
Target
Name:
Cytochrome P450 3A4
Synonyms:
Albendazole monooxygenase CP3A4_HUMAN CYP3A4 CYPIIIA4 Cytochrome P450 3A4 (CYP3A4) Nifedipine oxidase Taurochenodeoxycholate 6-alpha-hydroxylase
Type:
Enzyme
Mol. Mass.:
57349.57
Organism:
Homo sapiens (Human)
Description:
Residue:
503
  
Inhibitor
Name:
BDBM50205151
Synonyms:
CHEMBL3979311
Type:
Small organic molecule
Emp. Form.:
C26H34ClN3O5S
Mol. Mass.:
536.083
SMILES:
CC(=O)N1C2CCC1CN(C2)C(=O)CC1(CC1)[C@H]1COC[C@@H](C2CC2)N1S(=O)(=O)c1ccc(Cl)cc1
: