BDBM173537 (E)-N'-(4-hydroxybenzylidene)-1H-indole-2-carbohydrazide (9)
SMILES Oc1ccc(\C=N\NC(=O)c2cc3ccccc3[nH]2)cc1
InChI Key InChIKey=SCLFZAPTLAZAEI-LICLKQGHSA-N
Data  2 IC50
  Tab Delimited (TSV)   2D SDfile   Computed 3D by Vconf -m prep SDfile
Find this compound or compounds like it in BindingDB:
Activity Spreadsheet -- Enzyme Inhibition Constant Data from BindingDB
Found 2 hits for monomerid = 173537
TargetProbable maltase-glucoamylase 2(Homo sapiens)
Babasaheb Bhimrao Ambedkar University (A Central University)
Curated by ChEMBL
LigandPNGBDBM173537((E)-N'-(4-hydroxybenzylidene)-1H-indole-2-carb...)
Affinity DataIC50:  2.30E+3nM. Assay description: Inhibition of alpha-glucosidase (unknown origin) using pNPG as substrate preincubated for 10 mins followed by substrate addition measured after 30 mi...
In DepthDetails ArticlePubMed
TargetOligo-1,6-glucosidase IMA1(Saccharomyces cerevisiae S288c (Baker's yeast))
Universiti Teknologi Mara (Uitm)
LigandPNGBDBM173537((E)-N'-(4-hydroxybenzylidene)-1H-indole-2-carb...)
Affinity DataIC50:  2.06E+5nM. Assay description: The 135 µL of 50 mM phosphate saline buffer pH (6.8) was added in the 96-well plate and 20 µL of test sample with 70% DMSO added into the wells. The ...
In DepthDetails ArticlePubMed