BDBM17966 (6R)-1-(4-{3-[(2-methoxyphenyl)methoxy]propoxy}phenyl)-6-[(naphthalen-2-yloxy)methyl]piperazin-2-one::CHEMBL371426::Ketopiperazine-based compound, 2
SMILES COc1ccccc1COCCCOc1ccc(cc1)N1[C@@H](COc2ccc3ccccc3c2)CNCC1=O
InChI Key InChIKey=YNZFVUGNLOWSTD-MUUNZHRXSA-N
Data  3 IC50
  Tab Delimited (TSV)   2D SDfile   Computed 3D by Vconf -m prep SDfile
Find this compound or compounds like it in BindingDB:
Activity Spreadsheet -- Enzyme Inhibition Constant Data from BindingDB
Found 3 hits for monomerid = 17966
TargetRenin(Homo sapiens (Human))
Pfizer
LigandPNGBDBM17966((6R)-1-(4-{3-[(2-methoxyphenyl)methoxy]propoxy}phe...)
Affinity DataIC50:  54nMpH: 7.4 T: 2°C. Assay description: The renin assay utilized a tandem Green Flourescent Protein (tGFP) substrate that was hydrolyzed by human rennin. The tGFP substrate contained a nine...
In DepthDetails ArticlePubMed
TargetRenin(Homo sapiens (Human))
Pfizer
LigandPNGBDBM17966((6R)-1-(4-{3-[(2-methoxyphenyl)methoxy]propoxy}phe...)
Affinity DataIC50:  54nM. Assay description: Inhibition of human recombinant renin in buffer
In DepthDetails ArticlePubMed
TargetRenin(Homo sapiens (Human))
Pfizer
LigandPNGBDBM17966((6R)-1-(4-{3-[(2-methoxyphenyl)methoxy]propoxy}phe...)
Affinity DataIC50:  54nM. Assay description: Concentration required to inhibit renin activity by 50%
In DepthDetails ArticlePubMed