BDBM21884 2,9-disubstituted 6-oxopurine, 12h::9-{4-[2-(2-hydroxyethyl)piperidin-1-yl]butyl}-2-(phenylamino)-6,9-dihydro-3H-purin-6-one dihydrochloride
SMILES OCCC1CCCCN1CCCCn1cnc2c1nc(Nc1ccccc1)[nH]c2=O
InChI Key InChIKey=ATXXEVMPCXMMTG-UHFFFAOYSA-N
Data  2 IC50
  Tab Delimited (TSV)   2D SDfile   Computed 3D by Vconf -m prep SDfile
Find this compound or compounds like it in BindingDB:
Activity Spreadsheet -- Enzyme Inhibition Constant Data from BindingDB
Found 2 hits for monomerid = 21884
TargetThymidine kinase(Human herpesvirus 2)
Glsynthesis
LigandPNGBDBM21884(2,9-disubstituted 6-oxopurine, 12h | 9-{4-[2-(2-hy...)
Affinity DataIC50:  65nM. Assay description: Recombinant HSV TKs were assayed in reaction mixture containing substrate [3H-methyl]TdR and test compounds. After reaction was stopped, the radioact...
In DepthDetails ArticlePubMed
TargetThymidine kinase(Human herpesvirus 1)
Glsynthesis
LigandPNGBDBM21884(2,9-disubstituted 6-oxopurine, 12h | 9-{4-[2-(2-hy...)
Affinity DataIC50:  770nMpH: 7.5 T: 2°C. Assay description: Recombinant HSV TKs were assayed in reaction mixture containing substrate [3H-methyl]TdR and test compounds. After reaction was stopped, the radioact...
In DepthDetails ArticlePubMed