BDBM21888 2,9-disubstituted 6-oxopurine, 12l::2-(phenylamino)-9-{4-[2-(piperidin-1-ylmethyl)pyrrolidin-1-yl]butyl}-6,9-dihydro-3H-purin-6-one dihydrochloride
SMILES O=c1[nH]c(Nc2ccccc2)nc2n(CCCCN3CCCC3CN3CCCCC3)cnc12
InChI Key InChIKey=HAJPJLMUWGYXIF-UHFFFAOYSA-N
Data  2 IC50
  Tab Delimited (TSV)   2D SDfile   Computed 3D by Vconf -m prep SDfile
Find this compound or compounds like it in BindingDB:
Activity Spreadsheet -- Enzyme Inhibition Constant Data from BindingDB
Found 2 hits for monomerid = 21888
TargetThymidine kinase(Human herpesvirus 2)
Glsynthesis
LigandPNGBDBM21888(2,9-disubstituted 6-oxopurine, 12l | 2-(phenylamin...)
Affinity DataIC50:  130nM. Assay description: Recombinant HSV TKs were assayed in reaction mixture containing substrate [3H-methyl]TdR and test compounds. After reaction was stopped, the radioact...
In DepthDetails ArticlePubMed
TargetThymidine kinase(Human herpesvirus 1)
Glsynthesis
LigandPNGBDBM21888(2,9-disubstituted 6-oxopurine, 12l | 2-(phenylamin...)
Affinity DataIC50:  1.00E+3nMpH: 7.5 T: 2°C. Assay description: Recombinant HSV TKs were assayed in reaction mixture containing substrate [3H-methyl]TdR and test compounds. After reaction was stopped, the radioact...
In DepthDetails ArticlePubMed