BDBM21891 2,9-disubstituted 6-oxopurine, 12o::9-[4-(4-methoxypiperidin-1-yl)butyl]-2-(phenylamino)-6,9-dihydro-3H-purin-6-one dihydrochloride
SMILES COC1CCN(CCCCn2cnc3c2nc(Nc2ccccc2)[nH]c3=O)CC1
InChI Key InChIKey=OPLYHIHFDLCLEZ-UHFFFAOYSA-N
Data  2 IC50
  Tab Delimited (TSV)   2D SDfile   Computed 3D by Vconf -m prep SDfile
Find this compound or compounds like it in BindingDB:
Activity Spreadsheet -- Enzyme Inhibition Constant Data from BindingDB
Found 2 hits for monomerid = 21891
TargetThymidine kinase(Human herpesvirus 2)
Glsynthesis
LigandPNGBDBM21891(2,9-disubstituted 6-oxopurine, 12o | 9-[4-(4-metho...)
Affinity DataIC50:  140nM. Assay description: Recombinant HSV TKs were assayed in reaction mixture containing substrate [3H-methyl]TdR and test compounds. After reaction was stopped, the radioact...
In DepthDetails ArticlePubMed
TargetThymidine kinase(Human herpesvirus 1)
Glsynthesis
LigandPNGBDBM21891(2,9-disubstituted 6-oxopurine, 12o | 9-[4-(4-metho...)
Affinity DataIC50:  2.30E+3nMpH: 7.5 T: 2°C. Assay description: Recombinant HSV TKs were assayed in reaction mixture containing substrate [3H-methyl]TdR and test compounds. After reaction was stopped, the radioact...
In DepthDetails ArticlePubMed