BDBM50078618 CHEMBL3415173::US9278093, 2
SMILES Cc1nnc2CCc3cc(cc(F)c3-n12)-c1cncc(F)c1C
InChI Key InChIKey=MQHYBBKWHVWRSQ-UHFFFAOYSA-N
Data  6 IC50
  Tab Delimited (TSV)   2D SDfile   Computed 3D by Vconf -m prep SDfile
Find this compound or compounds like it in BindingDB:
Activity Spreadsheet -- Enzyme Inhibition Constant Data from BindingDB
Found 6 hits for monomerid = 50078618
TargetCytochrome P450 11B2, mitochondrial(Homo sapiens (Human))
Merck Sharp & Dohme
US Patent
LigandPNGBDBM50078618(CHEMBL3415173 | US9278093, 2)
Affinity DataIC50:  6nMT: 2°C. Assay description: Compounds of the Examples 1 to 3 were assayed for V79-Human-CYP11B2 and V79-Human-CYP11B1 by modifying the protocol described in J. Steroid Biochem. ...
In DepthDetails US Patent
TargetCytochrome P450 11B1, mitochondrial(Homo sapiens (Human))
Merck Sharp & Dohme
US Patent
LigandPNGBDBM50078618(CHEMBL3415173 | US9278093, 2)
Affinity DataIC50:  1.42E+3nMT: 2°C. Assay description: Compounds of the Examples 1 to 3 were assayed for V79-Human-CYP11B2 and V79-Human-CYP11B1 by modifying the protocol described in J. Steroid Biochem. ...
In DepthDetails US Patent
TargetSteroid 17-alpha-hydroxylase/17,20 lyase(Homo sapiens (Human))
Saarland University And Helmholtz Institute For Pharmaceutical Research Saarland (Hips)
Curated by ChEMBL
LigandPNGBDBM50078618(CHEMBL3415173 | US9278093, 2)
Affinity DataIC50: >1.00E+4nM. Assay description: Inhibition of human CYP17 expressed in Escherichia coli coexpressing human CYP17 and NADPH-P450 reductase
In DepthDetails ArticlePubMed
TargetCytochrome P450 11B2, mitochondrial(Homo sapiens (Human))
Merck Sharp & Dohme
US Patent
LigandPNGBDBM50078618(CHEMBL3415173 | US9278093, 2)
Affinity DataIC50:  20nM. Assay description: Inhibition of human CYP11B2 expressed in V79 MZh cells using [14C]-deoxycorticosterone substrate incubated for 6 hrs by HPTLC method
In DepthDetails ArticlePubMed
TargetAromatase(Homo sapiens (Human))
Saarland University And Helmholtz Institute For Pharmaceutical Research Saarland (Hips)
Curated by ChEMBL
LigandPNGBDBM50078618(CHEMBL3415173 | US9278093, 2)
Affinity DataIC50: >1.00E+4nM. Assay description: Inhibition of CYP19 in human placental microsomes using [1beta-3H]androstenedione substrate
In DepthDetails ArticlePubMed
TargetCytochrome P450 11B1, mitochondrial(Homo sapiens (Human))
Merck Sharp & Dohme
US Patent
LigandPNGBDBM50078618(CHEMBL3415173 | US9278093, 2)
Affinity DataIC50:  4.52E+3nM. Assay description: Inhibition of human CYP11B1 expressed in V79 MZh cells using [14C]-deoxycorticosterone substrate incubated for 6 hrs by HPTLC method
In DepthDetails ArticlePubMed