BDBM50102396 1-Phenyl-3-(4-pyrimidin-2-yl-piperazin-1-yl)-propan-1-one::1-phenyl-3-(4-(pyrimidin-2-yl)piperazin-1-yl)propan-1-one::CHEMBL133210
SMILES O=C(CCN1CCN(CC1)c1ncccn1)c1ccccc1
InChI Key InChIKey=PEUZJVQWTJDZOY-UHFFFAOYSA-N
Data  4 KI
  Tab Delimited (TSV)   2D SDfile   Computed 3D by Vconf -m prep SDfile
Find this compound or compounds like it in BindingDB:
Activity Spreadsheet -- Enzyme Inhibition Constant Data from BindingDB
Found 4 hits for monomerid = 50102396
Target5-hydroxytryptamine receptor 1A(Rattus norvegicus (rat))
Universidad De Navarra
Curated by ChEMBL
LigandPNGBDBM50102396(1-Phenyl-3-(4-pyrimidin-2-yl-piperazin-1-yl)-propa...)
Affinity DataKi:  120nM. Assay description: Binding affinity to 5-hydroxytryptamine 1A receptor (5-HT 1A receptor, serotonin receptor) from rat cortex using [3H]-8-OH-DPAT as radioligand
In DepthDetails ArticlePubMed
Target5-hydroxytryptamine receptor 1A(Homo sapiens (Human))
Universidade Federal Da Para£Ba
Curated by ChEMBL
LigandPNGBDBM50102396(1-Phenyl-3-(4-pyrimidin-2-yl-piperazin-1-yl)-propa...)
Affinity DataKi:  120nM. Assay description: Antagonist activity at 5HT1A
In DepthDetails ArticlePubMed
Target5-hydroxytryptamine receptor 1A(Homo sapiens (Human))
Universidade Federal Da Para£Ba
Curated by ChEMBL
LigandPNGBDBM50102396(1-Phenyl-3-(4-pyrimidin-2-yl-piperazin-1-yl)-propa...)
Affinity DataKi:  120nM. Assay description: Binding affinity to 5HT1A receptor
In DepthDetails ArticlePubMed
TargetSodium-dependent serotonin transporter(Rattus norvegicus (rat))
Universidad De Navarra
Curated by ChEMBL
LigandPNGBDBM50102396(1-Phenyl-3-(4-pyrimidin-2-yl-piperazin-1-yl)-propa...)
Affinity DataKi: >5.00E+3nM. Assay description: Binding affinity towards Serotonin transporter from rat cortex measured using [3H]-paroxetine
In DepthDetails ArticlePubMed