BDBM50300017 2-(biphenyl-4-yl)-1H-benzo[d]imidazole-4-carboxamide::CHEMBL578185
SMILES NC(=O)c1cccc2[nH]c(nc12)-c1ccc(cc1)-c1ccccc1
InChI Key InChIKey=YTKLAAYEYWFEIM-UHFFFAOYSA-N
Data  1 KI  2 IC50  1 EC50
  Tab Delimited (TSV)   2D SDfile   Computed 3D by Vconf -m prep SDfile
Find this compound or compounds like it in BindingDB:
Activity Spreadsheet -- Enzyme Inhibition Constant Data from BindingDB
Found 4 hits for monomerid = 50300017
TargetPoly [ADP-ribose] polymerase 1(Homo sapiens (Human))
Abbott Laboratories
Curated by ChEMBL
LigandPNGBDBM50300017(2-(biphenyl-4-yl)-1H-benzo[d]imidazole-4-carboxami...)
Affinity DataKi:  2nM. Assay description: Inhibition of PARP1 by scintillation counting
In DepthDetails ArticlePubMed
TargetPoly [ADP-ribose] polymerase 1(Homo sapiens (Human))
Abbott Laboratories
Curated by ChEMBL
LigandPNGBDBM50300017(2-(biphenyl-4-yl)-1H-benzo[d]imidazole-4-carboxami...)
Affinity DataEC50:  71nM. Assay description: Inhibition of PARP1 in human C41 cells after 30 mins by cell-based assay
In DepthDetails ArticlePubMed
TargetDihydroorotate dehydrogenase (quinone), mitochondrial(Homo sapiens (Human))
University Of Malaya
Curated by ChEMBL
LigandPNGBDBM50300017(2-(biphenyl-4-yl)-1H-benzo[d]imidazole-4-carboxami...)
Affinity DataIC50:  9.80E+3nM. Assay description: Inhibition of DHODH (unknown origin) using L-DHO, DUQ, DCIP as substrate preincubated for 30 mins followed by substrate addition measured after 20 mi...
In DepthDetails ArticlePubMed
TargetPoly [ADP-ribose] polymerase 1(Homo sapiens (Human))
Abbott Laboratories
Curated by ChEMBL
LigandPNGBDBM50300017(2-(biphenyl-4-yl)-1H-benzo[d]imidazole-4-carboxami...)
Affinity DataIC50:  710nM. Assay description: Inhibition of PARP-1 (unknown origin) assessed as incorporation of biotinylated poly (ADP-ribose) onto histone protein after 60 mins by TACS-Sapphire...
In DepthDetails ArticlePubMed