BDBM50351254 CHEMBL1818529
SMILES COc1ccc(cc1)C(SCCN)(c1ccccc1)c1ccccc1
InChI Key InChIKey=USJAPMAPKACCAJ-UHFFFAOYSA-N
Data  1 KI  1 IC50  1 EC50
  Tab Delimited (TSV)   2D SDfile   Computed 3D by Vconf -m prep SDfile
Find this compound or compounds like it in BindingDB:
Activity Spreadsheet -- Enzyme Inhibition Constant Data from BindingDB
Found 3 hits for monomerid = 50351254
TargetKinesin-like protein KIF11(Homo sapiens (Human))
The Beatson Institute For Cancer Research
Curated by ChEMBL
LigandPNGBDBM50351254(CHEMBL1818529)
Affinity DataKi:  22nM. Assay description: Inhibition of human N-terminal His6-tagged Eg5 (1 to 368 amino acid residues) motor domain basal ATPase activity expressed in Escherichia coli BL21 (...
In DepthDetails ArticlePubMed
TargetKinesin-like protein KIF11(Homo sapiens (Human))
The Beatson Institute For Cancer Research
Curated by ChEMBL
LigandPNGBDBM50351254(CHEMBL1818529)
Affinity DataIC50:  136nM. Assay description: Inhibition of human recombinant microtubule-activated KSP motor domain ATPase activity after 10 mins by end-point assay
In DepthDetails ArticlePubMed
TargetKinesin-like protein KIF11(Homo sapiens (Human))
The Beatson Institute For Cancer Research
Curated by ChEMBL
LigandPNGBDBM50351254(CHEMBL1818529)
Affinity DataEC50:  115nM. Assay description: Inhibition of KSP in human HeLa cells assessed as bipolar spindle formation
In DepthDetails ArticlePubMed