BDBM50389928 CHEMBL2071063
SMILES CCc1c([nH]c2ccc(Cl)cc12)C(=O)NCCc1ccc(cc1)N(C)C
InChI Key InChIKey=WVXDJOGNHLCWST-UHFFFAOYSA-N
Data  2 IC50  5 EC50
  Tab Delimited (TSV)   2D SDfile   Computed 3D by Vconf -m prep SDfile
Find this compound or compounds like it in BindingDB:
Activity Spreadsheet -- Enzyme Inhibition Constant Data from BindingDB
Found 7 hits for monomerid = 50389928
TargetCannabinoid receptor 1(Homo sapiens (Human))
Research Triangle Institute
Curated by ChEMBL
LigandPNGBDBM50389928(CHEMBL2071063)
Affinity DataIC50:  787nM. Assay description: Antagonist activity at human CB1 receptor expressed in CHO-RD-HGA16 cells assessed as inhibition of CP55940-induced calcium mobilization incubated fo...
In DepthDetails ArticlePubMed
TargetCannabinoid receptor 1(Homo sapiens (Human))
Research Triangle Institute
Curated by ChEMBL
LigandPNGBDBM50389928(CHEMBL2071063)
Affinity DataEC50:  210nM. Assay description: Agonist activity at human CB1 receptor expressed in HEK cells assessed as inhibition of forskolin-induced cAMP accumulation
In DepthDetails ArticlePubMed
TargetCannabinoid receptor 1(Homo sapiens (Human))
Research Triangle Institute
Curated by ChEMBL
LigandPNGBDBM50389928(CHEMBL2071063)
Affinity DataEC50:  600nM. Assay description: Activity at hemagglutinin-tagged human CB1 receptor expressed in HEK293 cells assessed as effect on forskolin-induced cAMP accumulation after 15 mins...
In DepthDetails ArticlePubMed
TargetCannabinoid receptor 2(Homo sapiens (Human))
Sapienza University Of Rome
Curated by ChEMBL
LigandPNGBDBM50389928(CHEMBL2071063)
Affinity DataIC50: >1.00E+4nM. Assay description: Allosteric modulation of human recombinant CB2 receptor expressed in HEK293 cells assessed as inhibition of [3H]CP55940 binding
In DepthDetails ArticlePubMed
TargetCannabinoid receptor 1(Homo sapiens (Human))
Research Triangle Institute
Curated by ChEMBL
LigandPNGBDBM50389928(CHEMBL2071063)
Affinity DataEC50:  430nM. Assay description: Activity at hemagglutinin-tagged human CB1 receptor expressed in HEK293 cells assessed as effect on forskolin-induced cAMP accumulation after 15 mins...
In DepthDetails ArticlePubMed
TargetCannabinoid receptor 1(Homo sapiens (Human))
Research Triangle Institute
Curated by ChEMBL
LigandPNGBDBM50389928(CHEMBL2071063)
Affinity DataEC50:  50nM. Assay description: Allosteric modulation of human recombinant CB1 receptor expressed in HEK293 cells assessed as stimulation of [3H]CP55940 binding
In DepthDetails ArticlePubMed
TargetCannabinoid receptor 1(Homo sapiens (Human))
Research Triangle Institute
Curated by ChEMBL
LigandPNGBDBM50389928(CHEMBL2071063)
Affinity DataEC50:  3.43E+3nM. Assay description: Activity at hemagglutinin-tagged human CB1 receptor expressed in HEK293 cells assessed as effect on forskolin-induced cAMP accumulation after 15 mins...
In DepthDetails ArticlePubMed