BDBM50586683 CHEMBL5078202
SMILES OC(=O)C(F)(F)F.OC(=O)C(F)(F)F.Cc1nc(N)sc1CCCN\C(N)=N\C(=O)NCCCCCCCCNC(=O)CCCCCNC(=O)COc1ccc(\C=C\C2=[N+]3C(C=C2)=Cc2ccc(-c4cccs4)n2[B-]3(F)F)cc1
InChI Key InChIKey=JMFCZAMEBGGRSY-JWZFBPJHSA-N
Data  1 KI  1 Kd  1 EC50
  Tab Delimited (TSV)   2D SDfile   Computed 3D by Vconf -m prep SDfile
Find this compound or compounds like it in BindingDB:
Activity Spreadsheet -- Enzyme Inhibition Constant Data from BindingDB
Found 3 hits for monomerid = 50586683
TargetHistamine H2 receptor(Homo sapiens (Human))
University Of Regensburg
Curated by ChEMBL
LigandPNGBDBM50586683(CHEMBL5078202)
Affinity DataKi:  30nM. Assay description: Displacement of [3H]UR-DE257 from Gsalphas-coupled human H2R expressed in Sf9 cell membranes by competitive binding assay
Ligand InfoPC cidPC sid
In DepthDetails ArticlePubMed
TargetHistamine H2 receptor(Homo sapiens (Human))
University Of Regensburg
Curated by ChEMBL
LigandPNGBDBM50586683(CHEMBL5078202)
Affinity DataEC50:  72nM. Assay description: Agonist activity at human H2 receptor expressed in Sf9 cell membranes co-exprssing GsalphaS assessed as stimulation of [35S]GTPgammaS binding incubat...
Ligand InfoPC cidPC sid
In DepthDetails ArticlePubMed
TargetHistamine H2 receptor(Homo sapiens (Human))
University Of Regensburg
Curated by ChEMBL
LigandPNGBDBM50586683(CHEMBL5078202)
Affinity DataKd:  81nM. Assay description: Binding affinity to human H2R expressed in HEK293T-qs5-HA cells by flow cytometry analysis
Ligand InfoPC cidPC sid
In DepthDetails ArticlePubMed