BDBM527574 US11186588, Example 36
SMILES Cc1nnc2N(Cc3ccc(Cl)cn3)N=C(c3c(C)c(C)sc3-n12)c1ccc(Cl)cc1
InChI Key InChIKey=UBXFMZQPXGGCRK-UHFFFAOYSA-N
Data  1 IC50
  Tab Delimited (TSV)   2D SDfile   Computed 3D by Vconf -m prep SDfile
Find this compound or compounds like it in BindingDB:
Activity Spreadsheet -- Enzyme Inhibition Constant Data from BindingDB
Found 1 hit for monomerid = 527574
TargetNuclear factor NF-kappa-B p105 subunit(Homo sapiens (Human))
Ayumi Pharmaceutical
US Patent
LigandPNGBDBM527574(US11186588, Example 36)
Affinity DataIC50:  401nM. Assay description: A549/NF-κB-luc cells (available from Panomics, Cat No. LR0051) were prepared at 375,000 cells/mL in the culture medium. The 375,000 cells/mL A54...
Ligand InfoPC cidPC sid
In DepthDetails US Patent