BDBM527586 US11186588, Example 50
SMILES COc1ccc(CN2N=C(c3c(C)c(C)sc3-n3c(C)nnc23)c2ccc(Cl)cc2)cn1
InChI Key InChIKey=NKMXIBHXKGFXTN-UHFFFAOYSA-N
Data  1 IC50
  Tab Delimited (TSV)   2D SDfile   Computed 3D by Vconf -m prep SDfile
Find this compound or compounds like it in BindingDB:
Activity Spreadsheet -- Enzyme Inhibition Constant Data from BindingDB
Found 1 hit for monomerid = 527586
TargetNuclear factor NF-kappa-B p105 subunit(Homo sapiens (Human))
Ayumi Pharmaceutical
US Patent
LigandPNGBDBM527586(US11186588, Example 50)
Affinity DataIC50:  355nM. Assay description: A549/NF-κB-luc cells (available from Panomics, Cat No. LR0051) were prepared at 375,000 cells/mL in the culture medium. The 375,000 cells/mL A54...
Ligand InfoPC cidPC sid
In DepthDetails US Patent