BDBM633986 US20230357139, Compound D
SMILES CCCOc1ccc(cc1)S(=O)(=O)N(CC(C)C)CC(=O)NO
InChI Key InChIKey=LBONIIUZVPZHAG-UHFFFAOYSA-N
Data  2 IC50
  Tab Delimited (TSV)   2D SDfile   Computed 3D by Vconf -m prep SDfile
Find this compound or compounds like it in BindingDB:
Activity Spreadsheet -- Enzyme Inhibition Constant Data from BindingDB
Found 2 hits for monomerid = 633986
TargetGelatinase()
Artizan Biosciences
US Patent
LigandPNGBDBM633986(US20230357139, Compound D)
Affinity DataIC50:  489nM. Assay description: Collagenase H Assay as a Surrogate for ColA Inhibition. Different concentrations of test compound were incubated with Clostridium histolyticum collag...
Ligand InfoPC cidPC sid
In DepthDetails US Patent
TargetCollagenase ColH(Hathewaya histolytica)
Artizan Biosciences
US Patent
LigandPNGBDBM633986(US20230357139, Compound D)
Affinity DataIC50: >1.00E+5nM. Assay description: Gelatinase E (Gel E) was purified from bacterial culture supernatant from E. faecalis. E. faecalis was cultured aerobically in Todd Hewitt Broth over...
Ligand InfoPC cidPC sid
In DepthDetails US Patent