BDBM96914 1-[(E)-[1-(4-chlorophenyl)-2,5-dimethyl-3-pyrrolyl]methylideneamino]-3-ethylthiourea::1-[(E)-[1-(4-chlorophenyl)-2,5-dimethyl-pyrrol-3-yl]methyleneamino]-3-ethyl-thiourea::1-[(E)-[1-(4-chlorophenyl)-2,5-dimethyl-pyrrol-3-yl]methylideneamino]-3-ethyl-thiourea::1-[(E)-[1-(4-chlorophenyl)-2,5-dimethylpyrrol-3-yl]methylideneamino]-3-ethylthiourea::MLS001033073::SMR000385529::cid_6904296
SMILES CCNC(=S)NN=Cc1cc(C)n(c1C)-c1ccc(Cl)cc1
InChI Key InChIKey=ZLCZLOPVTKAENK-UHFFFAOYSA-N
Data  2 IC50  2 EC50
  Tab Delimited (TSV)   2D SDfile   Computed 3D by Vconf -m prep SDfile
Find this compound or compounds like it in BindingDB:
Activity Spreadsheet -- Enzyme Inhibition Constant Data from BindingDB
Found 2 hits for monomerid = 96914
TargetTrace amine-associated receptor 1(Homo sapiens (Human))
The Scripps Research Institute Molecular Screening Center
Curated by PubChem BioAssay
LigandPNGBDBM96914(1-[(E)-[1-(4-chlorophenyl)-2,5-dimethyl-3-pyrrolyl...)
Affinity DataEC50:  1.36E+4nM
In DepthDetails PCBioAssay
TargetGuanine nucleotide-binding protein subunit alpha-15(Homo sapiens (Human))
The Scripps Research Institute Molecular Screening Center
Curated by PubChem BioAssay
LigandPNGBDBM96914(1-[(E)-[1-(4-chlorophenyl)-2,5-dimethyl-3-pyrrolyl...)
Affinity DataEC50: >2.99E+4nM
In DepthDetails PCBioAssay