Target
Transient receptor potential cation channel subfamily V member 1
Ligand
BDBM20462
Substrate
BDBM20458
Meas. Tech.
Radioligand Binding Assay and Agonist Ca2+ Influx Functional Assay
pH
7.4±n/a
Temperature
298.15±n/a K
Ki
>6310±n/a nM
EC50
1479±344 nM
Citation
 Bianchi, BREl Kouhen, RNeelands, TRLee, CHGomtsyan, ARaja, SNVaidyanathan, SNSurber, BMcDonald, HASurowy, CSFaltynek, CRMoreland, RBJarvis, MFPuttfarcken, PS [3H]A-778317 [1-((R)-5-tert-butyl-indan-1-yl)-3-isoquinolin-5-yl-urea]: a novel, stereoselective, high-affinity antagonist is a useful radioligand for the human transient receptor potential vanilloid-1 (TRPV1) receptor. J Pharmacol Exp Ther 323:285-93 (2007)  
Target
Name:
Transient receptor potential cation channel subfamily V member 1
Synonyms:
Capsaicin receptor Osm-9-like TRP channel 1 TRPV1_HUMAN Transient receptor potential cation channel subfamily V member 1 (TRPV1) Transient receptor potential cation channel subfamily V member 1(TRPV1) Vanilloid VR1 Vanilloid receptor 1 Vanilloid receptor 1 (VRI/TRPV1)
Type:
Protein
Mol. Mass.:
94960.75
Organism:
Homo sapiens (Human)
Description:
Q8NER1
Residue:
839
  
Inhibitor
Name:
BDBM20462
Synonyms:
(5Z,8Z,11Z,14Z)-N-[2-(3,4-dihydroxyphenyl)ethyl]icosa-5,8,11,14-tetraenamide CHEMBL138921 | N-arachidonoyl-dopamine (NADA)
Type:
Emp. Form.:
C28H41NO3
Mol. Mass.:
439.63
SMILES:
CCCCC\C=C/C\C=C/C\C=C/C\C=C/CCCC(=O)NCCc1ccc(O)c(O)c1
:
Substrate
Name:
BDBM20458
Synonyms:
1-[(1R)-5-tert-butyl-2,3-dihydro-1H-inden-1-yl]-3-isoquinolin-5-ylurea A-778317 [3H] A-778317
Type:
Small organic molecule
Emp. Form.:
C23H25N3O
Mol. Mass.:
359.4641
SMILES:
CC(C)(C)c1ccc2[C@@H](CCc2c1)NC(=O)Nc1cccc2cnccc12
: