Target
Urokinase-type plasminogen activator
Ligand
BDBM23716
Substrate
BDBM23734
Meas. Tech.
Human Neutrophil Elastase Inhibition Assay
IC50
33600±n/a nM
Citation
 Schepetkin, IAKhlebnikov, AIQuinn, MT N-benzoylpyrazoles are novel small-molecule inhibitors of human neutrophil elastase. J Med Chem 50:4928-38 (2007)  
Target
Name:
Urokinase-type plasminogen activator
Synonyms:
3.4.21.73 U-plasminogen activator Urokinase Urokinase-type plasminogen activator chain B Urokinase-type plasminogen activator short chain A uPA
Type:
Enzyme
Mol. Mass.:
48528.62
Organism:
Homo sapiens (Human)
Description:
P00749
Residue:
431
  
Inhibitor
Name:
BDBM23716
Synonyms:
N-Benzoylpyrazole deriv., 24 | N-{4-[(3-methyl-1H-pyrazol-1-yl)carbonyl]phenyl}acetamide
Type:
Small organic molecule
Emp. Form.:
C13H13N3O2
Mol. Mass.:
243.2612
SMILES:
CC(=O)Nc1ccc(cc1)C(=O)n1ccc(C)n1
:
Substrate
Name:
BDBM23734
Synonyms:
benzyloxycarbonyl-Gly-Gly-Arg-7-amino-4-methylcoumarin
Type:
Emp. Form.:
Mol. Mass.:
SMILES:
: