Target
Muscarinic acetylcholine receptor M1
Ligand
BDBM50005682
Substrate
Meas. Tech.
ChEBML_138403
Ki
41±n/a nM
Citation
 Leader, HGordon, RKBaumgold, JBoyd, VLNewman, AHSmejkal, RMChiang, PK Muscarinic receptor subtype specificity of (N,N-dialkylamino)alkyl 2-cyclohexyl-2-phenylpropionates: cylexphenes (cyclohexyl-substituted aprophen analogues). J Med Chem 35:1290-5 (1992)  
Target
Name:
Muscarinic acetylcholine receptor M1
Synonyms:
ACM1_HUMAN Cholinergic receptor, muscarinic 1 | Cholinergic, muscarinic M1
Type:
Protein
Mol. Mass.:
51442.54
Organism:
Homo sapiens (Human)
Description:
P11229
Residue:
460
  
Inhibitor
Name:
BDBM50005682
Synonyms:
2-Cyclohexyl-2-phenyl-propionic acid 4-dimethylamino-butyl ester | CHEMBL285440
Type:
Small organic molecule
Emp. Form.:
C21H33NO2
Mol. Mass.:
331.4922
SMILES:
CN(C)CCCCOC(=O)C(C)(C1CCCCC1)c1ccccc1
: