Target
Type-1 angiotensin II receptor
Ligand
BDBM50035444
Substrate
Meas. Tech.
ChEMBL_36631 (CHEMBL652870)
IC50
0.072000±n/a nM
Citation
 Chang, LLAshton, WTFlanagan, KLChen, TBO'Malley, SSZingaro, GJSiegl, PKKivlighn, SDLotti, VJChang, RS Triazolinone biphenylsulfonamides as angiotensin II receptor antagonists with high affinity for both the AT1 and AT2 subtypes. J Med Chem 37:4464-78 (1995)  
Target
Name:
Type-1 angiotensin II receptor
Synonyms:
AGTR1 ANGIOTENSIN AT1 Angiotensin II type 1a (AT-1a) receptor
Type:
Enzyme Catalytic Domain
Mol. Mass.:
41009.15
Organism:
RABBIT
Description:
ANGIOTENSIN AT1 AGTR1 RABBIT::P34976
Residue:
359
  
Inhibitor
Name:
BDBM50035444
Synonyms:
4-[[2'-[N-(tert-Butoxycarbonyl)sulfamoyl]biphenyl-4-yl]methyl]-5-n-butyl-2-[2-chloro-5-(valerylamino)phenyl]-2,4-dihydro-3H-1,2,4-trizol-3-one | CHEMBL341828
Type:
Small organic molecule
Emp. Form.:
C35H42ClN5O6S
Mol. Mass.:
696.256
SMILES:
CCCCC(=O)Nc1ccc(Cl)c(c1)-n1nc(CCCC)n(Cc2ccc(cc2)-c2ccccc2S(=O)(=O)NC(=O)OC(C)(C)C)c1=O
: