Target
Type-2 angiotensin II receptor
Ligand
BDBM50035445
Substrate
Meas. Tech.
ChEMBL_36767 (CHEMBL651097)
IC50
36±n/a nM
Citation
 Chang, LLAshton, WTFlanagan, KLChen, TBO'Malley, SSZingaro, GJSiegl, PKKivlighn, SDLotti, VJChang, RS Triazolinone biphenylsulfonamides as angiotensin II receptor antagonists with high affinity for both the AT1 and AT2 subtypes. J Med Chem 37:4464-78 (1995)  
Target
Name:
Type-2 angiotensin II receptor
Synonyms:
AGTR2_RAT Agtr2 Angiotensin II receptor Type-2 angiotensin II receptor
Type:
Enzyme Catalytic Domain
Mol. Mass.:
41346.62
Organism:
RAT
Description:
Angiotensin II AT2 0 0::P35351
Residue:
363
  
Inhibitor
Name:
BDBM50035445
Synonyms:
4'-[3-Butyl-5-oxo-1-(2-trifluoromethyl-phenyl)-1,5-dihydro-[1,2,4]triazol-4-ylmethyl]-biphenyl-2-sulfonic acid 2-chloro-benzoylamide | CHEMBL316300
Type:
Small organic molecule
Emp. Form.:
C33H28ClF3N4O4S
Mol. Mass.:
669.113
SMILES:
CCCCc1nn(-c2ccccc2C(F)(F)F)c(=O)n1Cc1ccc(cc1)-c1ccccc1S(=O)(=O)NC(=O)c1ccccc1Cl
: