Target
Corticotropin-releasing factor receptor 1
Ligand
BDBM50054254
Substrate
Meas. Tech.
ChEMBL_51122 (CHEMBL665735)
Ki
>10000±n/a nM
Citation
 Chen, CDagnino, RDe Souza, EBGrigoriadis, DEHuang, CQKim, KILiu, ZMoran, TWebb, TRWhitten, JPXie, YFMcCarthy, JR Design and synthesis of a series of non-peptide high-affinity human corticotropin-releasing factor1 receptor antagonists. J Med Chem 39:4358-60 (1996)  
Target
Name:
Corticotropin-releasing factor receptor 1
Synonyms:
CRF-R CRF1 CRFR1 CRH-R 1 CRHR1 Corticotropin-releasing factor receptor 1 (CRF-1) Corticotropin-releasing hormone receptor 1
Type:
Enzyme
Mol. Mass.:
50744.31
Organism:
Homo sapiens (Human)
Description:
P34998
Residue:
444
  
Inhibitor
Name:
BDBM50054254
Synonyms:
CHEMBL136593 | N-Cyclopropylmethyl-N-propyl-N'-(2,4,6-trichloro-phenyl)-pyrimidine-4,6-diamine
Type:
Small organic molecule
Emp. Form.:
C17H19Cl3N4
Mol. Mass.:
385.719
SMILES:
CCCN(CC1CC1)c1cc(Nc2c(Cl)cc(Cl)cc2Cl)ncn1
: