Target
Beta-1 adrenergic receptor
Ligand
BDBM50076960
Substrate
Meas. Tech.
ChEMBL_37243 (CHEMBL651564)
EC50
1900±n/a nM
Citation
 Shih, TLCandelore, MRCascieri, MAChiu, SHColwell, LFDeng, LFeeney, WPForrest, MJHom, GJMacIntyre, DEMiller, RRStearns, RAStrader, CDTota, LWyvratt, MJFisher, MHWeber, AE L-770,644: a potent and selective human beta3 adrenergic receptor agonist with improved oral bioavailability. Bioorg Med Chem Lett 9:1251-4 (1999)  
Target
Name:
Beta-1 adrenergic receptor
Synonyms:
ADRB1 ADRB1_HUMAN Beta-1 adrenoceptor adrenergic Beta1
Type:
G Protein-Coupled Receptor (GPCR)
Mol. Mass.:
51338.40
Organism:
Homo sapiens (Human)
Description:
P08588
Residue:
477
  
Inhibitor
Name:
BDBM50076960
Synonyms:
4-[4-(3-Cyclopentyl-propyl)-5-oxo-4,5-dihydro-tetrazol-1-yl]-N-{4-[2-((R)-2-hydroxy-2-pyridin-3-yl-ethylamino)-ethyl]-phenyl}-benzenesulfonamide | CHEMBL22375
Type:
Small organic molecule
Emp. Form.:
C30H37N7O4S
Mol. Mass.:
591.724
SMILES:
O[C@@H](CNCCc1ccc(NS(=O)(=O)c2ccc(cc2)-n2nnn(CCCC3CCCC3)c2=O)cc1)c1cccnc1
: