Target
Beta-3 adrenergic receptor
Ligand
BDBM50076960
Substrate
Meas. Tech.
ChEMBL_38789 (CHEMBL650698)
EC50
13±n/a nM
Citation
 Shih, TLCandelore, MRCascieri, MAChiu, SHColwell, LFDeng, LFeeney, WPForrest, MJHom, GJMacIntyre, DEMiller, RRStearns, RAStrader, CDTota, LWyvratt, MJFisher, MHWeber, AE L-770,644: a potent and selective human beta3 adrenergic receptor agonist with improved oral bioavailability. Bioorg Med Chem Lett 9:1251-4 (1999)  
Target
Name:
Beta-3 adrenergic receptor
Synonyms:
ADRB3 ADRB3_HUMAN Beta-2 adrenergic receptor and beta-3 adrenergic receptor Beta-3 adrenoreceptor | adrenergic Beta3
Type:
G Protein-Coupled Receptor (GPCR)
Mol. Mass.:
43534.88
Organism:
Homo sapiens (Human)
Description:
Residue:
408
  
Inhibitor
Name:
BDBM50076960
Synonyms:
4-[4-(3-Cyclopentyl-propyl)-5-oxo-4,5-dihydro-tetrazol-1-yl]-N-{4-[2-((R)-2-hydroxy-2-pyridin-3-yl-ethylamino)-ethyl]-phenyl}-benzenesulfonamide | CHEMBL22375
Type:
Small organic molecule
Emp. Form.:
C30H37N7O4S
Mol. Mass.:
591.724
SMILES:
O[C@@H](CNCCc1ccc(NS(=O)(=O)c2ccc(cc2)-n2nnn(CCCC3CCCC3)c2=O)cc1)c1cccnc1
: