Target
Nitric oxide synthase, endothelial
Ligand
BDBM50209245
Substrate
Meas. Tech.
ChEMBL_1890185 (CHEMBL4391939)
IC50
700±n/a nM
Citation
 Chalupova, KKorabecny, JBartolini, MMonti, BLamba, DCaliandro, RPesaresi, ABrazzolotto, XGastellier, AJNachon, FPejchal, JJarosova, MHepnarova, VJun, DHrabinova, MDolezal, RZdarova Karasova, JMzik, MKristofikova, ZMisik, JMuckova, LJost, PSoukup, OBenkova, MSetnicka, VHabartova, LChvojkova, MKleteckova, LVales, KMezeiova, EUliassi, EValis, MNepovimova, EBolognesi, MLKuca, K Novel tacrine-tryptophan hybrids: Multi-target directed ligands as potential treatment for Alzheimer's disease. Eur J Med Chem 168:491-514 (2019)  
Target
Name:
Nitric oxide synthase, endothelial
Synonyms:
Constitutive NOS Endothelial NOS NOS3_RAT Nos3 eNOS
Type:
PROTEIN
Mol. Mass.:
133297.24
Organism:
Rattus norvegicus
Description:
ChEMBL_812454
Residue:
1202
  
Inhibitor
Name:
BDBM50209245
Synonyms:
CHEMBL247378
Type:
Small organic molecule
Emp. Form.:
C7H5N3O2
Mol. Mass.:
163.1335
SMILES:
[O-][N+](=O)c1cccc2cn[nH]c12
: