Target
Beta-3 adrenergic receptor
Ligand
BDBM50089464
Substrate
Meas. Tech.
ChEBML_38786
EC50
130±n/a nM
Citation
 Feng, DDBiftu, TCandelore, MRCascieri, MAColwell, LFDeng, LFeeney, WPForrest, MJHom, GJMacIntyre, DEMiller, RRStearns, RAStrader, CDTota, LWyvratt, MJFisher, MHWeber, AE Discovery of an orally bioavailable alkyl oxadiazole beta3 adrenergic receptor agonist. Bioorg Med Chem Lett 10:1427-9 (2000)  
Target
Name:
Beta-3 adrenergic receptor
Synonyms:
ADRB3 ADRB3_HUMAN Beta-2 adrenergic receptor and beta-3 adrenergic receptor Beta-3 adrenoreceptor | adrenergic Beta3
Type:
G Protein-Coupled Receptor (GPCR)
Mol. Mass.:
43534.88
Organism:
Homo sapiens (Human)
Description:
Residue:
408
  
Inhibitor
Name:
BDBM50089464
Synonyms:
CHEMBL286800 | N-{4-[2-((R)-2-Hydroxy-2-pyridin-3-yl-ethylamino)-ethyl]-phenyl}-4-[5-(4-oxo-pentyl)-[1,2,4]oxadiazol-3-yl]-benzenesulfonamide
Type:
Small organic molecule
Emp. Form.:
C28H31N5O5S
Mol. Mass.:
549.641
SMILES:
CC(=O)CCCc1nc(no1)-c1ccc(cc1)S(=O)(=O)Nc1ccc(CCNC[C@H](O)c2cccnc2)cc1
: