Target
Beta-2 adrenergic receptor
Ligand
BDBM50090170
Substrate
Meas. Tech.
ChEBML_38318
IC50
310±n/a nM
Citation
 Ok, HOReigle, LBCandelore, MRCascieri, MAColwell, LFDeng, LFeeney, WPForrest, MJHom, GJMacIntyre, DEStrader, CDTota, LWang, PWyvratt, MJFisher, MHWeber, AE Substituted oxazole benzenesulfonamides as potent human beta3 adrenergic receptor agonists. Bioorg Med Chem Lett 10:1531-4 (2000)  
Target
Name:
Beta-2 adrenergic receptor
Synonyms:
ADRB2 ADRB2_HUMAN Beta-2 adrenoceptor | Beta-2 adrenoreceptor
Type:
Mol. Mass.:
46461.69
Organism:
Homo sapiens (Human)
Description:
P07550
Residue:
413
  
Inhibitor
Name:
BDBM50090170
Synonyms:
CHEMBL285520 | N-{4-[2-(2-Hydroxy-2-pyridin-3-yl-ethylamino)-ethyl]-phenyl}-4-[2-((R)-4-trifluoromethyl-benzyl)-oxazol-4-yl]-benzenesulfonamide
Type:
Small organic molecule
Emp. Form.:
C32H29F3N4O4S
Mol. Mass.:
622.657
SMILES:
O[C@@H](CNCCc1ccc(NS(=O)(=O)c2ccc(cc2)-c2coc(Cc3ccc(cc3)C(F)(F)F)n2)cc1)c1cccnc1
: