Target
Beta-2 adrenergic receptor
Ligand
BDBM50090165
Substrate
Meas. Tech.
ChEBML_38318
IC50
3500±n/a nM
Citation
 Ok, HOReigle, LBCandelore, MRCascieri, MAColwell, LFDeng, LFeeney, WPForrest, MJHom, GJMacIntyre, DEStrader, CDTota, LWang, PWyvratt, MJFisher, MHWeber, AE Substituted oxazole benzenesulfonamides as potent human beta3 adrenergic receptor agonists. Bioorg Med Chem Lett 10:1531-4 (2000)  
Target
Name:
Beta-2 adrenergic receptor
Synonyms:
ADRB2 ADRB2_HUMAN Beta-2 adrenoceptor | Beta-2 adrenoreceptor
Type:
Mol. Mass.:
46461.69
Organism:
Homo sapiens (Human)
Description:
P07550
Residue:
413
  
Inhibitor
Name:
BDBM50090165
Synonyms:
4-[2-((R)-4-Fluoro-3-fluoro-phenoxymethyl)-oxazol-4-yl]-N-{4-[2-(2-hydroxy-2-pyridin-3-yl-ethylamino)-ethyl]-phenyl}-benzenesulfonamide | CHEMBL36609
Type:
Small organic molecule
Emp. Form.:
C31H28F2N4O5S
Mol. Mass.:
606.64
SMILES:
O[C@@H](CNCCc1ccc(NS(=O)(=O)c2ccc(cc2)-c2coc(COc3ccc(F)c(F)c3)n2)cc1)c1cccnc1
: