Target
Beta-3 adrenergic receptor
Ligand
BDBM50090166
Substrate
Meas. Tech.
ChEBML_38923
EC50
210±n/a nM
Citation
 Ok, HOReigle, LBCandelore, MRCascieri, MAColwell, LFDeng, LFeeney, WPForrest, MJHom, GJMacIntyre, DEStrader, CDTota, LWang, PWyvratt, MJFisher, MHWeber, AE Substituted oxazole benzenesulfonamides as potent human beta3 adrenergic receptor agonists. Bioorg Med Chem Lett 10:1531-4 (2000)  
Target
Name:
Beta-3 adrenergic receptor
Synonyms:
ADRB3 ADRB3_HUMAN Beta-2 adrenergic receptor and beta-3 adrenergic receptor Beta-3 adrenoreceptor | adrenergic Beta3
Type:
G Protein-Coupled Receptor (GPCR)
Mol. Mass.:
43534.88
Organism:
Homo sapiens (Human)
Description:
Residue:
408
  
Inhibitor
Name:
BDBM50090166
Synonyms:
CHEMBL38861 | N-{4-[2-(2-Hydroxy-2-pyridin-3-yl-ethylamino)-ethyl]-phenyl}-4-[2-((R)-4-trifluoromethyl-phenoxymethyl)-oxazol-4-yl]-benzenesulfonamide
Type:
Small organic molecule
Emp. Form.:
C32H29F3N4O5S
Mol. Mass.:
638.657
SMILES:
O[C@@H](CNCCc1ccc(NS(=O)(=O)c2ccc(cc2)-c2coc(COc3ccc(cc3)C(F)(F)F)n2)cc1)c1cccnc1
: