Target
Beta-1 adrenergic receptor
Ligand
BDBM50090167
Substrate
Meas. Tech.
ChEBML_37386
IC50
3000±n/a nM
Citation
 Ok, HOReigle, LBCandelore, MRCascieri, MAColwell, LFDeng, LFeeney, WPForrest, MJHom, GJMacIntyre, DEStrader, CDTota, LWang, PWyvratt, MJFisher, MHWeber, AE Substituted oxazole benzenesulfonamides as potent human beta3 adrenergic receptor agonists. Bioorg Med Chem Lett 10:1531-4 (2000)  
Target
Name:
Beta-1 adrenergic receptor
Synonyms:
ADRB1 ADRB1_HUMAN Beta-1 adrenoceptor adrenergic Beta1
Type:
G Protein-Coupled Receptor (GPCR)
Mol. Mass.:
51338.40
Organism:
Homo sapiens (Human)
Description:
P08588
Residue:
477
  
Inhibitor
Name:
BDBM50090167
Synonyms:
CHEMBL39269 | N-{(R)-4-[2-(2-Hydroxy-2-pyridin-3-yl-ethylamino)-ethyl]-phenyl}-4-(2-phenyl-oxazol-5-yl)-benzenesulfonamide
Type:
Small organic molecule
Emp. Form.:
C30H28N4O4S
Mol. Mass.:
540.633
SMILES:
O[C@@H](CNCCc1ccc(NS(=O)(=O)c2ccc(cc2)-c2cnc(o2)-c2ccccc2)cc1)c1cccnc1
: