Target
Beta-1 adrenergic receptor
Ligand
BDBM50090169
Substrate
Meas. Tech.
ChEBML_37386
IC50
200±n/a nM
Citation
 Ok, HOReigle, LBCandelore, MRCascieri, MAColwell, LFDeng, LFeeney, WPForrest, MJHom, GJMacIntyre, DEStrader, CDTota, LWang, PWyvratt, MJFisher, MHWeber, AE Substituted oxazole benzenesulfonamides as potent human beta3 adrenergic receptor agonists. Bioorg Med Chem Lett 10:1531-4 (2000)  
Target
Name:
Beta-1 adrenergic receptor
Synonyms:
ADRB1 ADRB1_HUMAN Beta-1 adrenoceptor adrenergic Beta1
Type:
G Protein-Coupled Receptor (GPCR)
Mol. Mass.:
51338.40
Organism:
Homo sapiens (Human)
Description:
P08588
Residue:
477
  
Inhibitor
Name:
BDBM50090169
Synonyms:
CHEMBL39577 | N-{(R)-4-[2-(2-Hydroxy-2-pyridin-3-yl-ethylamino)-ethyl]-phenyl}-4-(2-pentyl-oxazol-5-yl)-benzenesulfonamide
Type:
Small organic molecule
Emp. Form.:
C29H34N4O4S
Mol. Mass.:
534.67
SMILES:
CCCCCc1ncc(o1)-c1ccc(cc1)S(=O)(=O)Nc1ccc(CCNC[C@H](O)c2cccnc2)cc1
: